Target
Corticosteroid-binding globulin
Ligand
BDBM17289
Substrate
Meas. Tech.
ChEMBL_48199 (CHEMBL665995)
Ki
10000±n/a nM
Citation
 Kotani, THigashiura, K Comparative molecular active site analysis (CoMASA). 1. An approach to rapid evaluation of 3D QSAR. J Med Chem 47:2732-42 (2004)  
Target
Name:
Corticosteroid-binding globulin
Synonyms:
CBG Corticosteroid binding globulin | SERPINA6
Type:
PROTEIN
Mol. Mass.:
45136.82
Organism:
Homo sapiens
Description:
ChEMBL_10503
Residue:
405
  
Inhibitor
Name:
BDBM17289
Synonyms:
(1S,10R,11S,15S)-5-hydroxy-15-methyltetracyclo[8.7.0.0^{2,7}.0^{11,15}]heptadeca-2,4,6-trien-14-one Estrone Estrone, 15 Kestrone Unigen [2,4,6,7-3H]-Estrone | folliculin
Type:
Steroid
Emp. Form.:
C18H22O2
Mol. Mass.:
270.3661
SMILES:
[H][C@@]12CCC(=O)[C@@]1(C)CC[C@]1([H])c3ccc(O)cc3CC[C@@]21[H]
: