Target
Androgen receptor
Ligand
BDBM18661
Substrate
Meas. Tech.
ChEMBL_304043 (CHEMBL877110)
Ki
2.9±n/a nM
Citation
 Söderholm, AALehtovuori, PTNyrönen, TH Three-dimensional structure-activity relationships of nonsteroidal ligands in complex with androgen receptor ligand-binding domain. J Med Chem 48:917-25 (2005)  
Target
Name:
Androgen receptor
Synonyms:
ANDR_RAT Ar Nr3c4 | androgen
Type:
Enzyme
Mol. Mass.:
98219.08
Organism:
Rattus norvegicus (Rat)
Description:
P15207
Residue:
902
  
Inhibitor
Name:
BDBM18661
Synonyms:
(2R)-3-[(4-acetamidophenyl)sulfanyl]-2-hydroxy-2-methyl-N-[4-nitro-3-(trifluoromethyl)phenyl]propanamide | Nonsteroidal AR Ligand, R-2
Type:
Small organic molecule
Emp. Form.:
C19H18F3N3O5S
Mol. Mass.:
457.424
SMILES:
CC(=O)Nc1ccc(SC[C@](C)(O)C(=O)Nc2ccc(c(c2)C(F)(F)F)[N+]([O-])=O)cc1
: