Target
Reverse transcriptase
Ligand
BDBM50013111
Substrate
Meas. Tech.
ChEMBL_437168 (CHEMBL906565)
IC50
60±n/a nM
Citation
 Mackman, RLZhang, LPrasad, VBoojamra, CGDouglas, JGrant, DHui, HKim, CULaflamme, GParrish, JStoycheva, ADSwaminathan, SWang, KCihlar, T Synthesis, anti-HIV activity, and resistance profile of thymidine phosphonomethoxy nucleosides and their bis-isopropyloxymethylcarbonyl (bisPOC) prodrugs. Bioorg Med Chem 15:5519-28 (2007)  
Target
Name:
Reverse transcriptase
Synonyms:
Type:
Protein
Mol. Mass.:
29598.37
Organism:
Human immunodeficiency virus 1
Description:
Q9WKE8
Residue:
254
  
Inhibitor
Name:
BDBM50013111
Synonyms:
1-((2R,5S)-5-(hydroxymethyl)-2,5-dihydrofuran-2-yl)-5-methylpyrimidine-2,4(1H,3H)-dione 1-(5-Hydroxymethyl-2,5-dihydro-furan-2-yl)-5-methyl-1H-pyrimidine-2,4-dione 2',3'-didehydro-3'-deoxythymidine 3'-deoxy-2',3'-didehydrothymidine BMY-27857 STAVUDINE Zerit xr cid_5155 | d4T
Type:
Small organic molecule
Emp. Form.:
C10H12N2O4
Mol. Mass.:
224.2133
SMILES:
Cc1cn([C@@H]2O[C@H](CO)C=C2)c(=O)[nH]c1=O
: