Target
Reverse transcriptase
Ligand
BDBM50370476
Substrate
Meas. Tech.
ChEMBL_471453 (CHEMBL952768)
IC50
300±n/a nM
Citation
 Lennerstrand, JChu, CKSchinazi, RF Biochemical studies on the mechanism of human immunodeficiency virus type 1 reverse transcriptase resistance to 1-(beta-D-dioxolane)thymine triphosphate. Antimicrob Agents Chemother 51:2078-84 (2007)  
Target
Name:
Reverse transcriptase
Synonyms:
Type:
Protein
Mol. Mass.:
29598.37
Organism:
Human immunodeficiency virus 1
Description:
Q9WKE8
Residue:
254
  
Inhibitor
Name:
BDBM50370476
Synonyms:
Combivir | ZIDOVUDINE TRIPHOSPHATE
Type:
Small organic molecule
Emp. Form.:
C10H16N5O13P3
Mol. Mass.:
507.181
SMILES:
Cc1cn([C@H]2C[C@H](N=[N+]=[N-])[C@@H](CO[P@@](O)(=O)O[P@@](O)(=O)OP(O)(O)=O)O2)c(=O)[nH]c1=O
: