Target
3-oxoacyl-[acyl-carrier-protein] synthase 2
Ligand
BDBM50479869
Substrate
Meas. Tech.
ChEMBL_566016 (CHEMBL964115)
IC50
166000±n/a nM
Citation
 Shen, HCDing, FXSingh, SBParthasarathy, GSoisson, SMHa, SNChen, XKodali, SWang, JDorso, KTata, JRHammond, MLMaccoss, MColletti, SL Synthesis and biological evaluation of platensimycin analogs. Bioorg Med Chem Lett 19:1623-7 (2009)  
Target
Name:
3-oxoacyl-[acyl-carrier-protein] synthase 2
Synonyms:
2.3.1.179 3-oxoacyl-[acyl-carrier-protein] synthase II FABF_STAAU fabF
Type:
PROTEIN
Mol. Mass.:
42419.21
Organism:
Staphylococcus aureus
Description:
ChEMBL_100958
Residue:
403
  
Inhibitor
Name:
BDBM50479869
Synonyms:
CHEMBL523161
Type:
Small organic molecule
Emp. Form.:
C23H27NO8
Mol. Mass.:
445.4624
SMILES:
CC12CC34CC1CC(O2)C3[C@](C)(CCC(=O)Nc1c(O)ccc(C(O)=O)c1O)C(=O)OC4
: