Target
Replicase polyprotein 1ab
Ligand
BDBM50480494
Substrate
Meas. Tech.
ChEMBL_575375 (CHEMBL1027049)
Ki
462000±n/a nM
Citation
 Regnier, TSarma, DHidaka, KBacha, UFreire, EHayashi, YKiso, Y New developments for the design, synthesis and biological evaluation of potent SARS-CoV 3CL(pro) inhibitors. Bioorg Med Chem Lett 19:2722-7 (2009)  
Target
Name:
Replicase polyprotein 1ab
Synonyms:
3C-like proteinase 3C-like proteinase (SARS-CoV 3Cpro) 3CLp GFL Guanine-N7 methyltransferase Helicase Leader protein Non-structural protein 10 Non-structural protein 3 Non-structural protein 6 Non-structural protein 8 ORF1ab polyprotein PL2-PRO Pol R1AB_SARS RdRp SARS coronavirus main proteinase nsp1 nsp12 nsp14 nsp16 nsp3 nsp5 nsp7 nsp9 pp1ab | rep
Type:
Protein
Mol. Mass.:
790250.81
Organism:
Human SARS coronavirus (SARS-CoV) (Severe acute respiratory syndrome coronavirus)
Description:
P0C6X7
Residue:
7073
  
Inhibitor
Name:
BDBM50480494
Synonyms:
CHEMBL551504 | acs.jmedchem.1c00409_ST.804
Type:
Small organic molecule
Emp. Form.:
C26H36N4O5S
Mol. Mass.:
516.653
SMILES:
CCN(CC)C(=O)CC[C@H](NC(=O)[C@H](CC(C)C)NC(=O)OCc1ccccc1)C(=O)c1nccs1
: