Target
Beta-lactamase
Ligand
BDBM50053173
Substrate
Meas. Tech.
ChEMBL_645699 (CHEMBL1217813)
IC50
2000±n/a nM
Citation
 Poirel, LDocquier, JDDe Luca, FVerlinde, AIde, LRossolini, GMNordmann, P BEL-2, an extended-spectrum beta-lactamase with increased activity toward expanded-spectrum cephalosporins in Pseudomonas aeruginosa. Antimicrob Agents Chemother 54:533-5 (2010)  
Target
Name:
Beta-lactamase
Synonyms:
3.5.2.6 | Beta-lactamase
Type:
PROTEIN
Mol. Mass.:
30982.09
Organism:
Pseudomonas aeruginosa
Description:
ChEMBL_117206
Residue:
283
  
Inhibitor
Name:
BDBM50053173
Synonyms:
(2S,3S,5R)-3-Methyl-4,4,7-trioxo-3-[1,2,3]triazol-1-ylmethyl-4-thia-1-aza-bicyclo[3.2.0]heptane-2-carboxylic acid (2S,3S,5R)-3-methyl-4,4,7-trioxo-3-[1,2,3]triazol-1-ylmethyl-4lambda6-thia-1-aza-bicyclo[3.2.0]heptane-2-carboxylic acid 3-Methyl-4,4,7-trioxo-3-[1,2,3]triazol-1-ylmethyl-4lambda*6*-thia-1-aza-bicyclo[3.2.0]heptane-2-carboxylic acid CL-298741 US9120808, Tazobactam sodium salt YTR-830H | Zosyn
Type:
Small organic molecule
Emp. Form.:
C10H12N4O5S
Mol. Mass.:
300.291
SMILES:
C[C@]1(Cn2ccnn2)[C@@H](N2[C@@H](CC2=O)S1(=O)=O)C(O)=O
: