Target
Integrase
Ligand
BDBM25351
Substrate
Meas. Tech.
ChEMBL_666886 (CHEMBL1262283)
IC50
16±n/a nM
Citation
 Garvey, EPJohns, BAGartland, MJFoster, SAMiller, WHFerris, RGHazen, RJUnderwood, MRBoros, EEThompson, JBWeatherhead, JGKoble, CSAllen, SHSchaller, LTSherrill, RGYoshinaga, TKobayashi, MWakasa-Morimoto, CMiki, SNakahara, KNoshi, TSato, AFujiwara, T The naphthyridinone GSK364735 is a novel, potent human immunodeficiency virus type 1 integrase inhibitor and antiretroviral. Antimicrob Agents Chemother 52:901-8 (2008)  
Target
Name:
Integrase
Synonyms:
pol
Type:
PROTEIN
Mol. Mass.:
32203.43
Organism:
Human immunodeficiency virus 1
Description:
ChEMBL_106649
Residue:
288
  
Inhibitor
Name:
BDBM25351
Synonyms:
N-[2-(4-{[(4-fluorophenyl)methyl]carbamoyl}-5-hydroxy-1-methyl-6-oxo-1,6-dihydropyrimidin-2-yl)propan-2-yl]-5-methyl-1,3,4-oxadiazole-2-carboxamide | Raltegravir
Type:
Small organic molecule
Emp. Form.:
C20H21FN6O5
Mol. Mass.:
444.4163
SMILES:
Cc1nnc(o1)C(=O)NC(C)(C)c1nc(C(=O)NCc2ccc(F)cc2)c(O)c(=O)n1C
: