Target
Replicase polyprotein 1ab
Ligand
BDBM50483063
Substrate
Meas. Tech.
ChEMBL_685466 (CHEMBL1285497)
IC50
24300±n/a nM
Citation
 Ramajayam, RTan, KPLiu, HGLiang, PH Synthesis and evaluation of pyrazolone compounds as SARS-coronavirus 3C-like protease inhibitors. Bioorg Med Chem 18:7849-54 (2010)  
Target
Name:
Replicase polyprotein 1ab
Synonyms:
3C-like proteinase 3C-like proteinase (SARS-CoV 3Cpro) 3CLp GFL Guanine-N7 methyltransferase Helicase Leader protein Non-structural protein 10 Non-structural protein 3 Non-structural protein 6 Non-structural protein 8 ORF1ab polyprotein PL2-PRO Pol R1AB_SARS RdRp SARS coronavirus main proteinase nsp1 nsp12 nsp14 nsp16 nsp3 nsp5 nsp7 nsp9 pp1ab | rep
Type:
Protein
Mol. Mass.:
790250.81
Organism:
Human SARS coronavirus (SARS-CoV) (Severe acute respiratory syndrome coronavirus)
Description:
P0C6X7
Residue:
7073
  
Inhibitor
Name:
BDBM50483063
Synonyms:
CHEMBL1277136
Type:
Small organic molecule
Emp. Form.:
C23H14Cl2N2O3
Mol. Mass.:
437.275
SMILES:
OC(=O)c1ccc(\C=C2/C(=O)N(N=C2c2ccccc2)c2ccc(Cl)c(Cl)c2)cc1
: