Target
Penicillin-binding protein 1A
Ligand
BDBM50422689
Substrate
Meas. Tech.
ChEMBL_706008 (CHEMBL1662822)
IC50
386±n/a nM
Citation
 Kosowska-Shick, KMcGhee, PAppelbaum, PC Binding of faropenem and other beta-lactam agents to penicillin-binding proteins of pneumococci with various beta-lactam susceptibilities. Antimicrob Agents Chemother 53:2176-80 (2009)  
Target
Name:
Penicillin-binding protein 1A
Synonyms:
2.4.1.129 DD-transpeptidase PBPA_STRPN Penicillin-insensitive transglycosylase Peptidoglycan TGase | ponA
Type:
PROTEIN
Mol. Mass.:
79749.99
Organism:
Streptococcus pneumoniae serotype 4 (strain ATCC BAA-334 / TIGR4)
Description:
ChEMBL_103552
Residue:
719
  
Inhibitor
Name:
BDBM50422689
Synonyms:
640/359 | CEFUROXIME
Type:
Small organic molecule
Emp. Form.:
C16H16N4O8S
Mol. Mass.:
424.385
SMILES:
CO\N=C(/C(=O)N[C@H]1[C@H]2SCC(COC(N)=O)=C(N2C1=O)C(O)=O)c1ccco1
: