Target
Penicillin-binding protein 2x
Ligand
BDBM50022787
Substrate
Meas. Tech.
ChEMBL_706026 (CHEMBL1662840)
IC50
23.9±n/a nM
Citation
 Kosowska-Shick, KMcGhee, PAppelbaum, PC Binding of faropenem and other beta-lactam agents to penicillin-binding proteins of pneumococci with various beta-lactam susceptibilities. Antimicrob Agents Chemother 53:2176-80 (2009)  
Target
Name:
Penicillin-binding protein 2x
Synonyms:
PBPX_STRPN | pbpX
Type:
PROTEIN
Mol. Mass.:
82307.00
Organism:
Streptococcus pneumoniae
Description:
ChEMBL_653273
Residue:
750
  
Inhibitor
Name:
BDBM50022787
Synonyms:
(+)-3,3-Dimethyl-7-oxo-6-phenylacetylamino-4-thia-1-aza-bicyclo[3.2.0]heptane-2-carboxylic acid(penicillin G) (2S,5R,6R)-3,3-dimethyl-7-oxo-6-(2-phenylacetamido)-4-thia-1-aza-bicyclo[3.2.0]heptane-2-carboxylic acid 3,3-Dimethyl-7-oxo-6-phenylacetylamino-4-thia-1-aza-bicyclo[3.2.0]heptane-2-carboxylic acid anion (Penicillin G) BICILLIN PENICILLIN G PROCAINE PERMAPEN PFIZERPEN-AS | benzylpenicillin
Type:
Small organic molecule
Emp. Form.:
C16H18N2O4S
Mol. Mass.:
334.39
SMILES:
CC1(C)S[C@@H]2[C@H](NC(=O)Cc3ccccc3)C(=O)N2[C@H]1C(O)=O
: