Target
Probable maltase-glucoamylase 2
Ligand
BDBM50501991
Substrate
Meas. Tech.
ChEMBL_1806320 (CHEMBL4305679)
IC50
70±n/a nM
Citation
 Dhameja, MGupta, P Synthetic heterocyclic candidates as promising ?-glucosidase inhibitors: An overview. Eur J Med Chem 176:343-377 (2019)  
Target
Name:
Probable maltase-glucoamylase 2
Synonyms:
3.2.1.3 Glucoamylase MGAM2 Probable maltase-glucoamylase 2
Type:
PROTEIN
Mol. Mass.:
277932.17
Organism:
Homo sapiens
Description:
ChEMBL_116927
Residue:
2515
  
Inhibitor
Name:
BDBM50501991
Synonyms:
CHEMBL4551617
Type:
Small organic molecule
Emp. Form.:
C42H26N8O10S2
Mol. Mass.:
866.833
SMILES:
[O-][N+](=O)c1ccc(cc1)C(Nc1ccc(NC(c2ccc(cc2)[N+]([O-])=O)n2nc(oc2=S)-c2cc3ccccc3oc2=O)cc1)n1nc(oc1=S)-c1cc(=O)oc2ccccc12
: