Target
Probable maltase-glucoamylase 2
Ligand
BDBM50502047
Substrate
Meas. Tech.
ChEMBL_1806323 (CHEMBL4305682)
Ki
22000±n/a nM
Citation
 Dhameja, MGupta, P Synthetic heterocyclic candidates as promising ?-glucosidase inhibitors: An overview. Eur J Med Chem 176:343-377 (2019)  
Target
Name:
Probable maltase-glucoamylase 2
Synonyms:
3.2.1.3 Glucoamylase MGAM2 Probable maltase-glucoamylase 2
Type:
PROTEIN
Mol. Mass.:
277932.17
Organism:
Homo sapiens
Description:
ChEMBL_116927
Residue:
2515
  
Inhibitor
Name:
BDBM50502047
Synonyms:
CHEMBL4459976
Type:
Small organic molecule
Emp. Form.:
C26H20N2O4
Mol. Mass.:
424.448
SMILES:
Cc1ccc(cc1)C(c1c(N)c2ccccc2oc1=O)c1c(N)c2ccccc2oc1=O
: