Target
Reverse transcriptase
Ligand
BDBM50118233
Substrate
Meas. Tech.
ChEMBL_721311 (CHEMBL1675423)
Kd
3200±n/a nM
Citation
 Sluis-Cremer, NKoontz, DBassit, LHernandez-Santiago, BIDetorio, MRapp, KLAmblard, FBondada, LGrier, JCoats, SJSchinazi, RFMellors, JW Anti-human immunodeficiency virus activity, cross-resistance, cytotoxicity, and intracellular pharmacology of the 3'-azido-2',3'-dideoxypurine nucleosides. Antimicrob Agents Chemother 53:3715-9 (2009)  
Target
Name:
Reverse transcriptase
Synonyms:
Type:
Protein
Mol. Mass.:
29598.37
Organism:
Human immunodeficiency virus 1
Description:
Q9WKE8
Residue:
254
  
Inhibitor
Name:
BDBM50118233
Synonyms:
2'-deoxyadenosine 5'-(tetrahydrogen triphosphate) CHEMBL335538 | dATP
Type:
Small organic molecule
Emp. Form.:
C10H16N5O12P3
Mol. Mass.:
491.1816
SMILES:
Nc1ncnc2n(cnc12)[C@H]1C[C@H](O)[C@@H](COP(O)(=O)OP(O)(=O)OP(O)(O)=O)O1
: