Target
1,3-beta-glucan synthase
Ligand
BDBM50483789
Substrate
Meas. Tech.
ChEMBL_744789 (CHEMBL1772810)
IC50
281±n/a nM
Citation
 Zhou, GTing, PCAslanian, RCao, JKim, DWKuang, RLee, JFSchwerdt, JWu, HHerr, RJZych, AJYang, JLam, SWainhaus, SBlack, TAMcNicholas, PMXu, YWalker, SS SAR studies of pyridazinone derivatives as novel glucan synthase inhibitors. Bioorg Med Chem Lett 21:2890-3 (2011)  
Target
Name:
1,3-beta-glucan synthase
Synonyms:
1,3-beta-glucan synthase Glucan Synthase
Type:
Enzyme
Mol. Mass.:
218006.59
Organism:
Candida albicans (Yeast)
Description:
O13428
Residue:
1897
  
Inhibitor
Name:
BDBM50483789
Synonyms:
CHEMBL1770509
Type:
Small organic molecule
Emp. Form.:
C28H30ClN5O4S
Mol. Mass.:
568.087
SMILES:
Cn1ccc2ccc(cc12)S(=O)(=O)N1CCN(CC1)c1cnn(-c2cccc(Cl)c2)c(=O)c1OC1CCCC1
: