Target
1,3-beta-glucan synthase
Ligand
BDBM50483790
Substrate
Meas. Tech.
ChEMBL_744789 (CHEMBL1772810)
IC50
378±n/a nM
Citation
 Zhou, GTing, PCAslanian, RCao, JKim, DWKuang, RLee, JFSchwerdt, JWu, HHerr, RJZych, AJYang, JLam, SWainhaus, SBlack, TAMcNicholas, PMXu, YWalker, SS SAR studies of pyridazinone derivatives as novel glucan synthase inhibitors. Bioorg Med Chem Lett 21:2890-3 (2011)  
Target
Name:
1,3-beta-glucan synthase
Synonyms:
1,3-beta-glucan synthase Glucan Synthase
Type:
Enzyme
Mol. Mass.:
218006.59
Organism:
Candida albicans (Yeast)
Description:
O13428
Residue:
1897
  
Inhibitor
Name:
BDBM50483790
Synonyms:
CHEMBL1770510
Type:
Small organic molecule
Emp. Form.:
C26H29ClN4O4S
Mol. Mass.:
529.051
SMILES:
Clc1cccc(c1)-n1ncc(N2CCN(CC2)S(=O)(=O)Cc2ccccc2)c(OC2CCCC2)c1=O
: