Target
1,3-beta-glucan synthase
Ligand
BDBM50483806
Substrate
Meas. Tech.
ChEMBL_744789 (CHEMBL1772810)
IC50
140±n/a nM
Citation
 Zhou, GTing, PCAslanian, RCao, JKim, DWKuang, RLee, JFSchwerdt, JWu, HHerr, RJZych, AJYang, JLam, SWainhaus, SBlack, TAMcNicholas, PMXu, YWalker, SS SAR studies of pyridazinone derivatives as novel glucan synthase inhibitors. Bioorg Med Chem Lett 21:2890-3 (2011)  
Target
Name:
1,3-beta-glucan synthase
Synonyms:
1,3-beta-glucan synthase Glucan Synthase
Type:
Enzyme
Mol. Mass.:
218006.59
Organism:
Candida albicans (Yeast)
Description:
O13428
Residue:
1897
  
Inhibitor
Name:
BDBM50483806
Synonyms:
CHEMBL1770514
Type:
Small organic molecule
Emp. Form.:
C27H28ClN5O5S
Mol. Mass.:
570.06
SMILES:
Clc1cccc(c1)-n1ncc(N2CCN(CC2)S(=O)(=O)Cc2noc3ccccc23)c(OC2CCCC2)c1=O
: