Target
Reverse transcriptase
Ligand
BDBM50370476
Substrate
Meas. Tech.
ChEMBL_768876 (CHEMBL1831952)
Kd
55000±n/a nM
Citation
 Zhang, HWDetorio, MHerman, BDSolomon, SBassit, LNettles, JHObikhod, ATao, SJMellors, JWSluis-Cremer, NCoats, SJSchinazi, RF Synthesis, antiviral activity, cytotoxicity and cellular pharmacology of l-3'-azido-2',3'-dideoxypurine nucleosides. Eur J Med Chem 46:3832-44 (2011)  
Target
Name:
Reverse transcriptase
Synonyms:
Type:
Protein
Mol. Mass.:
29598.37
Organism:
Human immunodeficiency virus 1
Description:
Q9WKE8
Residue:
254
  
Inhibitor
Name:
BDBM50370476
Synonyms:
Combivir | ZIDOVUDINE TRIPHOSPHATE
Type:
Small organic molecule
Emp. Form.:
C10H16N5O13P3
Mol. Mass.:
507.181
SMILES:
Cc1cn([C@H]2C[C@H](N=[N+]=[N-])[C@@H](CO[P@@](O)(=O)O[P@@](O)(=O)OP(O)(O)=O)O2)c(=O)[nH]c1=O
: