Target
Polyphenol oxidase 2
Ligand
BDBM60579
Substrate
Meas. Tech.
ChEMBL_827169 (CHEMBL2050453)
Ki
374±n/a nM
Citation
 Ha, YMPark, YJKim, JAPark, DPark, JYLee, HJLee, JYMoon, HRChung, HY Design and synthesis of 5-(substituted benzylidene)thiazolidine-2,4-dione derivatives as novel tyrosinase inhibitors. Eur J Med Chem 49:245-52 (2012)  
Target
Name:
Polyphenol oxidase 2
Synonyms:
Monophenol monooxygenase PPO2 Tyrosinase
Type:
Protein
Mol. Mass.:
63923.66
Organism:
Agaricus bisporus (Common mushroom)
Description:
O42713
Residue:
556
  
Inhibitor
Name:
BDBM60579
Synonyms:
(5Z)-5-(4-hydroxybenzylidene)thiazolidine-2,4-quinone (5Z)-5-[(4-hydroxyphenyl)methylidene]thiazolidine-2,4-dione SMR000324608 | cid_1276529
Type:
Small organic molecule
Emp. Form.:
C10H7NO3S
Mol. Mass.:
221.232
SMILES:
Oc1ccc(\C=C2/SC(=O)NC2=O)cc1
: