Target
Solute carrier family 15 member 1
Ligand
BDBM50344967
Substrate
Meas. Tech.
ChEMBL_837003 (CHEMBL2075937)
IC50
160000±n/a nM
Citation
 Terada, TSawada, KSaito, HHashimoto, YInui, K Inhibitory effect of novel oral hypoglycemic agent nateglinide (AY4166) on peptide transporters PEPT1 and PEPT2. Eur J Pharmacol 392:11-7 (2000)  
Target
Name:
Solute carrier family 15 member 1
Synonyms:
Intestinal H(+)/peptide cotransporter Pept1 Proton-coupled dipeptide cotransporter Slc15a1
Type:
PROTEIN
Mol. Mass.:
78933.78
Organism:
Rattus norvegicus
Description:
ChEMBL_1488841
Residue:
710
  
Inhibitor
Name:
BDBM50344967
Synonyms:
2-[(4-Isopropyl-cyclohexanecarbonyl)-amino]-3-phenyl-propionic acid AY-4166 DJN-608 SDZ-DJN-608 | Starlix
Type:
Small organic molecule
Emp. Form.:
C19H27NO3
Mol. Mass.:
317.4226
SMILES:
CC(C)[C@H]1CC[C@@H](CC1)C(=O)N[C@H](Cc1ccccc1)C(O)=O
: