Target
Solute carrier family 15 member 1
Ligand
BDBM50169127
Substrate
Meas. Tech.
ChEMBL_838264 (CHEMBL2076212)
Ki
990000±n/a nM
Citation
 Terada, TSawada, KIrie, MSaito, HHashimoto, YInui, K Structural requirements for determining the substrate affinity of peptide transporters PEPT1 and PEPT2. Pflugers Arch 440:679-84 (2000)  
Target
Name:
Solute carrier family 15 member 1
Synonyms:
Intestinal H(+)/peptide cotransporter Pept1 Proton-coupled dipeptide cotransporter Slc15a1
Type:
PROTEIN
Mol. Mass.:
78933.78
Organism:
Rattus norvegicus
Description:
ChEMBL_1488841
Residue:
710
  
Inhibitor
Name:
BDBM50169127
Synonyms:
(S)-2-((S)-2-Amino-3-carboxy-propionylamino)-succinic acid Asp-Asp | CHEMBL17171
Type:
Small organic molecule
Emp. Form.:
C8H12N2O7
Mol. Mass.:
248.1901
SMILES:
N[C@@H](CC(O)=O)C(=O)N[C@@H](CC(O)=O)C(O)=O
: