Target
Solute carrier family 22 member 6
Ligand
BDBM50344959
Substrate
Meas. Tech.
ChEMBL_837481 (CHEMBL2075969)
Ki
>300000±n/a nM
Citation
 Nagata, YKusuhara, HEndou, HSugiyama, Y Expression and functional characterization of rat organic anion transporter 3 (rOat3) in the choroid plexus. Mol Pharmacol 61:982-8 (2002)  
Target
Name:
Solute carrier family 22 member 6
Synonyms:
Oat1 S22A6_RAT rOAT1 renal organic anion transporter 1
Type:
PROTEIN
Mol. Mass.:
60784.17
Organism:
Rattus norvegicus
Description:
ChEMBL_838479
Residue:
551
  
Inhibitor
Name:
BDBM50344959
Synonyms:
17beta-Estradiol-17-(beta-D-glucuronide) E17β-glucuronide | estradiol 17b glucuronide
Type:
Small organic molecule
Emp. Form.:
C24H32O8
Mol. Mass.:
448.5061
SMILES:
C[C@]12CC[C@H]3[C@@H](CCc4cc(O)ccc34)[C@@H]1CC[C@@H]2O[C@@H]1O[C@@H]([C@@H](O)[C@H](O)[C@H]1O)C(O)=O
: