Target
Solute carrier family 22 member 8
Ligand
BDBM50370587
Substrate
Meas. Tech.
ChEMBL_838483 (CHEMBL2076054)
Ki
780000±n/a nM
Citation
 Jung, KYTakeda, MShimoda, MNarikawa, STojo, AKim, DKChairoungdua, AChoi, BKKusuhara, HSugiyama, YSekine, TEndou, H Involvement of rat organic anion transporter 3 (rOAT3) in cephaloridine-induced nephrotoxicity: in comparison with rOAT1. Life Sci 70:1861-74 (2002)  
Target
Name:
Solute carrier family 22 member 8
Synonyms:
Oat3 S22A8_RAT rOat3
Type:
PROTEIN
Mol. Mass.:
59199.83
Organism:
Rattus norvegicus
Description:
ChEMBL_1482580
Residue:
536
  
Inhibitor
Name:
BDBM50370587
Synonyms:
CEFAZOLIN
Type:
Small organic molecule
Emp. Form.:
C14H14N8O4S3
Mol. Mass.:
454.507
SMILES:
Cc1nnc(SCC2=C(N3[C@H](SC2)[C@H](NC(=O)Cn2cnnn2)C3=O)C(O)=O)s1
: