Target
Solute carrier family 15 member 2
Ligand
BDBM84007
Substrate
Meas. Tech.
ChEMBL_836935 (CHEMBL2075775)
IC50
3200000±n/a nM
Citation
 Ganapathy, MEPrasad, PDMackenzie, BGanapathy, VLeibach, FH Interaction of anionic cephalosporins with the intestinal and renal peptide transporters PEPT 1 and PEPT 2. Biochim Biophys Acta 1324:296-308 (1997)  
Target
Name:
Solute carrier family 15 member 2
Synonyms:
Oligopeptide transporter, kidney isoform S15A2_RAT | Slc15a2
Type:
PROTEIN
Mol. Mass.:
81331.63
Organism:
Rattus norvegicus
Description:
ChEMBL_838253
Residue:
729
  
Inhibitor
Name:
BDBM84007
Synonyms:
CEFIXIME MLS002222332 cid_5362065
Type:
Small organic molecule
Emp. Form.:
C16H15N5O7S2
Mol. Mass.:
453.45
SMILES:
Nc1nc(cs1)C(=N\OCC(O)=O)\C(=O)N[C@H]1[C@H]2SCC(C=C)=C(N2C1=O)C(O)=O
: