Target
Catalase
Ligand
BDBM50207159
Substrate
Meas. Tech.
ChEMBL_892182 (CHEMBL3051428)
IC50
500000±n/a nM
Citation
 Ford, KAGulevich, AGSwenson, TLCasida, JE Neonicotinoid insecticides: oxidative stress in planta and metallo-oxidase inhibition. J Agric Food Chem 59:4860-7 (2011)  
Target
Name:
Catalase
Synonyms:
1.11.1.6 CATA_BOVIN | Catalase
Type:
PROTEIN
Mol. Mass.:
59923.64
Organism:
Bos taurus
Description:
ChEMBL_105512
Residue:
527
  
Inhibitor
Name:
BDBM50207159
Synonyms:
2-aminoguanidine AMINOGUANIDINE Guanyl hydrazine Monoaminoguanidine | hydrazinecarboximidamide
Type:
Small organic molecule
Emp. Form.:
CH6N4
Mol. Mass.:
74.0851
SMILES:
NNC(N)=N
: