Target
Aldehyde oxidase 1
Ligand
BDBM50212288
Substrate
Meas. Tech.
ChEMBL_892184 (CHEMBL3051430)
IC50
>1000000±n/a nM
Citation
 Ford, KAGulevich, AGSwenson, TLCasida, JE Neonicotinoid insecticides: oxidative stress in planta and metallo-oxidase inhibition. J Agric Food Chem 59:4860-7 (2011)  
Target
Name:
Aldehyde oxidase 1
Synonyms:
AO AOXA_RABIT Retinal oxidase
Type:
PROTEIN
Mol. Mass.:
147140.36
Organism:
Oryctolagus cuniculus
Description:
ChEMBL_696368
Residue:
1334
  
Inhibitor
Name:
BDBM50212288
Synonyms:
(2E)-1-[(6-chloropyridin-3-yl)methyl]-N-nitroimidazolidin-2-imine CHEMBL406819
Type:
Small organic molecule
Emp. Form.:
C9H10ClN5O2
Mol. Mass.:
255.661
SMILES:
[O-][N+](=O)NC1=NCCN1Cc1ccc(Cl)nc1
: