Target
Alpha-1B adrenergic receptor
Ligand
BDBM50487266
Substrate
Meas. Tech.
ChEMBL_911062 (CHEMBL3056709)
EC50
3802±n/a nM
Citation
  TBA Med Chem Res 13:134-148 (2004)    Article 
Target
Name:
Alpha-1B adrenergic receptor
Synonyms:
ADA1B_RAT Alpha 1B-adrenoceptor Alpha adrenergic receptor 1A and 1B Alpha-1Adrenoceptor Alpha-1B adrenoreceptor | adrenergic Alpha1B
Type:
G Protein-Coupled Receptor (GPCR)
Mol. Mass.:
56606.71
Organism:
Rattus norvegicus (rat)
Description:
Receptor binding assays were performed using rat cortical membranes.
Residue:
515
  
Inhibitor
Name:
BDBM50487266
Synonyms:
CHEMBL2261355
Type:
Small organic molecule
Emp. Form.:
C15H19N3O2S
Mol. Mass.:
305.395
SMILES:
CCS(=O)(=O)Nc1cccc2[C@@H](CCCc12)c1c[nH]cn1
: