Target
Type-1 angiotensin II receptor A
Ligand
BDBM50030474
Substrate
Meas. Tech.
ChEMBL_910062 (CHEMBL3055782)
Ki
0.230000±n/a nM
Citation
  TBA Med Chem Res 18:589-610 (2009)    Article 
Target
Name:
Type-1 angiotensin II receptor A
Synonyms:
AGTRA_RAT Agtr1 Angiotensin II AT1 Angiotensin II receptor (AT-1) type-1 Type-1A angiotensin II receptor
Type:
Enzyme Catalytic Domain
Mol. Mass.:
40910.53
Organism:
RAT
Description:
ANGIOTENSIN AT1 AGTR1 RAT::P25095
Residue:
359
  
Inhibitor
Name:
BDBM50030474
Synonyms:
Avandamet Avandia CHEBI:50122 US10744117, Compound Rosiglitazone | US9562012, rosiglitazone
Type:
Small organic molecule
Emp. Form.:
C18H19N3O3S
Mol. Mass.:
357.427
SMILES:
CN(CCOc1ccc(CC2SC(=O)NC2=O)cc1)c1ccccn1
: