Target
Mu-type opioid receptor
Ligand
BDBM50033536
Substrate
Meas. Tech.
ChEMBL_148516 (CHEMBL758126)
Ki
0.13±n/a nM
Citation
 Wang, ZXZhu, YCJin, WQChen, XJChen, JJi, RYChi, ZQ Stereoisomers of N-[1-hydroxy-(2-phenylethyl)-3-methyl-4-piperidyl]- N-phenylpropanamide: synthesis, stereochemistry, analgesic activity, and opioid receptor binding characteristics. J Med Chem 38:3652-9 (1995)  
Target
Name:
Mu-type opioid receptor
Synonyms:
M-OR-1 Mor OPRM_MOUSE Oprm | Oprm1
Type:
Enzyme Catalytic Domain
Mol. Mass.:
44431.62
Organism:
MOUSE
Description:
OPIATE Mu OPRM1 MOUSE::P42866
Residue:
398
  
Inhibitor
Name:
BDBM50033536
Synonyms:
CHEMBL121494 | N-[(3R,4R)-1-((R)-2-Hydroxy-2-phenyl-ethyl)-3-methyl-piperidin-4-yl]-N-phenyl-propionamide
Type:
Small organic molecule
Emp. Form.:
C23H30N2O2
Mol. Mass.:
366.4965
SMILES:
CCC(=O)N([C@@H]1CCN(C[C@H](O)c2ccccc2)C[C@H]1C)c1ccccc1
: