Target
Acetylcholinesterase
Ligand
BDBM50169859
Substrate
Meas. Tech.
ChEMBL_931328 (CHEMBL3069985)
IC50
220±n/a nM
Citation
  TBA Med Chem Res 22:2328-2345 (2013)    Article 
Target
Name:
Acetylcholinesterase
Synonyms:
ACES_RAT Acetylcholinesterase and butyrylcholinesterase (AChE and BChE) Acetylcholinesterase, AChE | Ache
Type:
Enzyme
Mol. Mass.:
68193.62
Organism:
Rattus norvegicus (rat)
Description:
P37136
Residue:
614
  
Inhibitor
Name:
BDBM50169859
Synonyms:
2-[4-(1-Diethylamino-ethyl)-phenoxy]-5,6-dimethoxy-indan-1-one | CHEMBL181125
Type:
Small organic molecule
Emp. Form.:
C23H29NO4
Mol. Mass.:
383.4807
SMILES:
CCN(CC)C(C)c1ccc(OC2Cc3cc(OC)c(OC)cc3C2=O)cc1
: