Target
Aldo-keto reductase family 1 member B1
Ligand
BDBM16315
Substrate
Meas. Tech.
ChEMBL_932739 (CHEMBL3083988)
IC50
0.840±n/a nM
Citation
  TBA Med Chem Res 22:2539-2552 (2013)    Article 
Target
Name:
Aldo-keto reductase family 1 member B1
Synonyms:
AKR1B1 ALDR_HUMAN AR Aldose Reductase (ALR2) Aldose reductase (AR)
Type:
Protein
Mol. Mass.:
35855.50
Organism:
Homo sapiens (Human)
Description:
P15121. 4LAU; 2IKI; 4LB4; 2FZD; 2FZ8; 1US0
Residue:
316
  
Inhibitor
Name:
BDBM16315
Synonyms:
6-[(5-chloro-3-methyl-1-benzofuran-2-)sulfonyl]-2,3-dihydropyridazin-3-one 62P CP-744809 Pyridazinone | benzofuran, 24
Type:
Small organic molecule
Emp. Form.:
C13H9ClN2O4S
Mol. Mass.:
324.74
SMILES:
Cc1c(oc2ccc(Cl)cc12)S(=O)(=O)c1ccc(=O)[nH]n1
: