Target
Seed linoleate 13S-lipoxygenase-1
Ligand
BDBM50489111
Substrate
Meas. Tech.
ChEMBL_930119 (CHEMBL3068968)
Ki
2011±n/a nM
Citation
  TBA Med Chem Res 22:5036-5043 (2013)    Article 
Target
Name:
Seed linoleate 13S-lipoxygenase-1
Synonyms:
15-LOX 15-lipo-oxygenase (SLO) L-1 LOX1.1 Lipoxygenase (LOX) Lipoxygenase-1 | Seed lipoxygenase-1
Type:
Enzyme
Mol. Mass.:
94365.66
Organism:
Glycine max (soybean)
Description:
Residue:
839
  
Inhibitor
Name:
BDBM50489111
Synonyms:
CHEMBL2296822
Type:
Small organic molecule
Emp. Form.:
C17H20N4OS
Mol. Mass.:
328.432
SMILES:
CCCc1nc(nc2Sc3ccccc3Nc12)N1CCOCC1
: