Target
Aldehyde dehydrogenase 1A1
Ligand
BDBM50035001
Substrate
Meas. Tech.
ChEMBL_31156 (CHEMBL646621)
IC50
270000±n/a nM
Citation
 Nagasawa, HTDeMaster, EGGoon, DJKawle, SPShirota, FN Carbethoxylating agents as inhibitors of aldehyde dehydrogenase. J Med Chem 38:1872-6 (1995)  
Target
Name:
Aldehyde dehydrogenase 1A1
Synonyms:
AL1A1_RAT Aldh1a1
Type:
PROTEIN
Mol. Mass.:
54465.59
Organism:
Rattus norvegicus
Description:
ChEMBL_31158
Residue:
501
  
Inhibitor
Name:
BDBM50035001
Synonyms:
CHEMBL53508 | Carbonic acid benzotriazol-1-yl ester ethyl ester
Type:
Small organic molecule
Emp. Form.:
C9H9N3O3
Mol. Mass.:
207.1861
SMILES:
CCOC(=O)On1nnc2ccccc12
: