Target
Beta-2 adrenergic receptor
Ligand
BDBM50295572
Substrate
Meas. Tech.
ChEMBL_982327 (CHEMBL2426847)
Kd
501±n/a nM
Citation
 Peterson, YKCameron, RBWills, LPTrager, RELindsey, CCBeeson, CCSchnellmann, RG ?2-Adrenoceptor agonists in the regulation of mitochondrial biogenesis. Bioorg Med Chem Lett 23:5376-81 (2013)  
Target
Name:
Beta-2 adrenergic receptor
Synonyms:
ADRB2 ADRB2_HUMAN Beta-2 adrenoceptor | Beta-2 adrenoreceptor
Type:
Mol. Mass.:
46461.69
Organism:
Homo sapiens (Human)
Description:
P07550
Residue:
413
  
Inhibitor
Name:
BDBM50295572
Synonyms:
5-(1-Hydroxy-2-isopropylamino-ethyl)-benzene-1,3-diol Alupent METAPROTERENOL Prometa [2-(3,5-Dihydroxy-phenyl)-2-hydroxy-ethyl]-isopropyl-ammonium (orciprenaline)
Type:
Small organic molecule
Emp. Form.:
C11H17NO3
Mol. Mass.:
211.2576
SMILES:
CC(C)NCC(O)c1cc(O)cc(O)c1
: