Target
Sodium- and chloride-dependent GABA transporter 2
Ligand
BDBM50039251
Substrate
Meas. Tech.
ChEMBL_202727 (CHEMBL809055)
IC50
1410000±n/a nM
Citation
 Dhar, TGBorden, LATyagarajan, SSmith, KEBranchek, TAWeinshank, RLGluchowski, C Design, synthesis and evaluation of substituted triarylnipecotic acid derivatives as GABA uptake inhibitors: identification of a ligand with moderate affinity and selectivity for the cloned human GABA transporter GAT-3. J Med Chem 37:2334-42 (1994)  
Target
Name:
Sodium- and chloride-dependent GABA transporter 2
Synonyms:
GABA transporter Gabt2 S6A13_RAT | Slc6a13
Type:
PROTEIN
Mol. Mass.:
68261.89
Organism:
Rattus norvegicus
Description:
ChEMBL_70051
Residue:
602
  
Inhibitor
Name:
BDBM50039251
Synonyms:
(R)-1-(4,4-bis(3-methylthiophen-2-yl)but-3-enyl)piperidine-3-carboxylic acid hydrochloride (R)-1-[4,4-Bis-(3-methyl-thiophen-2-yl)-but-3-enyl]-piperidine-3-carboxylic acid; hydrochloride 1-[4,4-Bis-(3-methyl-4,5-dihydro-thiophen-2-yl)-but-3-enyl]-piperidine-3-carboxylic acid A-70569-1 ABBOTT-70569-1 CHEMBL1027 NNC-05-0328 TIAGABINE | Tiagabine hydrochloride
Type:
Small organic molecule
Emp. Form.:
C20H25NO2S2
Mol. Mass.:
375.548
SMILES:
[#6]-c1ccsc1\[#6](=[#6]/[#6]-[#6]-[#7]-1-[#6]-[#6]-[#6]-[#6@H](-[#6]-1)-[#6](-[#8])=O)-c1sccc1-[#6]
: