Target
Angiotensin-converting enzyme
Ligand
BDBM21642
Substrate
Meas. Tech.
ChEMBL_1275976 (CHEMBL3088740)
Ki
2.0±n/a nM
Citation
 Végner, LPeragovics, ÁTombor, LJelinek, BCzobor, PBender, ASimon, ZMálnási-Csizmadia, A Experimental confirmation of new drug-target interactions predicted by Drug Profile Matching. J Med Chem 56:8377-88 (2013)  
Target
Name:
Angiotensin-converting enzyme
Synonyms:
ACE Angiotensin converting enzyme (ACE) Angiotensin-converting enzyme, soluble form CD_antigen=CD143 DCP1 Kininase II
Type:
Enzyme
Mol. Mass.:
149709.01
Organism:
Homo sapiens (Human)
Description:
Residue:
1306
  
Inhibitor
Name:
BDBM21642
Synonyms:
(2S)-1-[(2S)-2-methyl-3-sulfanylpropanoyl]pyrrolidine-2-carboxylic acid Capozide Lopirin SQ14534 | US11491146, Compound L-Captopril
Type:
Small organic molecule
Emp. Form.:
C9H15NO3S
Mol. Mass.:
217.285
SMILES:
C[C@H](CS)C(=O)N1CCC[C@H]1C(O)=O
: