Target
Sodium-dependent dopamine transporter
Ligand
BDBM50495103
Substrate
Meas. Tech.
ChEMBL_1285657 (CHEMBL3106616)
Ki
1.3±n/a nM
Citation
 Rami-Mark, CBornatowicz, BFink, COtter, PUngersboeck, JVraka, CHaeusler, DNics, LSpreitzer, HHacker, MMitterhauser, MWadsak, W Synthesis, radiosynthesis and first in vitro evaluation of novel PET-tracers for the dopamine transporter: [(11)C]IPCIT and [(18)F]FE@IPCIT. Bioorg Med Chem 21:7562-9 (2013)  
Target
Name:
Sodium-dependent dopamine transporter
Synonyms:
DA transporter DAT1 Dopamine transporter protein (DAT) SC6A3_HUMAN Sodium-dependent dopamine transporter Solute carrier family 6 member 3
Type:
Multi-pass membrane protein
Mol. Mass.:
68497.11
Organism:
Homo sapiens (Human)
Description:
Q01959
Residue:
620
  
Inhibitor
Name:
BDBM50495103
Synonyms:
CHEMBL3105243
Type:
Small organic molecule
Emp. Form.:
C19H22FI2NO2
Mol. Mass.:
569.1908
SMILES:
[H][C@]12CC[C@]([H])([C@H]([C@H](C1)c1ccc(I)cc1)C(=O)OCCF)N2C\C=C\I
: