Target
Mu-type opioid receptor
Ligand
BDBM50495238
Substrate
Meas. Tech.
ChEMBL_1283864 (CHEMBL3106315)
Ki
29±n/a nM
Citation
 Bender, AMClark, MJAgius, MPTraynor, JRMosberg, HI Synthesis and evaluation of 4-substituted piperidines and piperazines as balanced affinity ? opioid receptor (MOR) agonist/? opioid receptor (DOR) antagonist ligands. Bioorg Med Chem Lett 24:548-51 (2014)  
Target
Name:
Mu-type opioid receptor
Synonyms:
MOR-1 Mu-type opioid receptor (MOR) OPRM_RAT Opioid receptor B Ror-b
Type:
G Protein-Coupled Receptor (GPCR)
Mol. Mass.:
44503.11
Organism:
Rattus norvegicus (rat)
Description:
Competition binding assays were carried out using membrane preparations from transfected HN9.10 cells that constitutively expressed the mu opioid receptor.
Residue:
398
  
Inhibitor
Name:
BDBM50495238
Synonyms:
CHEMBL3104105
Type:
Small organic molecule
Emp. Form.:
C27H30N2O2
Mol. Mass.:
414.5393
SMILES:
Cc1cc(O)cc(C)c1C[C@H](N)C(=O)N1CCC(Cc2ccccc2)c2ccccc12
: