Target
Voltage-dependent L-type calcium channel subunit alpha-1C/alpha-1D/alpha-1S
Ligand
BDBM85330
Substrate
Meas. Tech.
ChEMBL_44706 (CHEMBL656595)
Ki
>10000±n/a nM
Citation
 van Wijngaarden, IHamminga, Dvan Hes, RStandaar, PJTipker, JTulp, MTMol, FOlivier, Bde Jonge, A Development of high-affinity 5-HT3 receptor antagonists. Structure-affinity relationships of novel 1,7-annelated indole derivatives. J Med Chem 36:3693-9 (1994)  
Target
Name:
Voltage-dependent L-type calcium channel subunit alpha-1C/alpha-1D/alpha-1S
Synonyms:
Voltage-gated L-type calcium channel
Type:
Mol. Mass.:
Description:
ASSAY_ID of ChEMBL is 92765
Components:
This complex has 3 components.
Component 1
Name:
Voltage-dependent L-type calcium channel subunit alpha-1D
Synonyms:
CAC1D_RAT Cacn4 Cacnl1a2 Cav1.3/Cav beta3/Cav alpha2delta complex RBD Voltage-dependent L-type calcium channel subunit alpha-1D Voltage-gated calcium channel subunit alpha Cav1.3
Type:
PROTEIN
Mol. Mass.:
250148.41
Organism:
Rattus norvegicus
Description:
ChEMBL_44709
Residue:
2203
  
Component 2
Name:
Voltage-dependent L-type calcium channel subunit alpha-1C
Synonyms:
CAC1C_RAT Cacn2 Cacnl1a1 Calcium channel (Type L) Calcium channel, L type, alpha-1 polypeptide, isoform 1, cardiac muscle RBC Voltage-dependent L-type calcium channel subunit alpha-1C Voltage-gated L-type calcium channel alpha-1C subunit | Voltage-gated calcium channel subunit alpha Cav1.2
Type:
Enzyme Catalytic Domain
Mol. Mass.:
243492.26
Organism:
RAT
Description:
Calcium channel 0 RAT::P22002
Residue:
2169
  
Component 3
Name:
Voltage-dependent L-type calcium channel subunit alpha-1S
Synonyms:
CAC1S_RAT Cacn1 Cacnl1a3 Cchl1a3 Voltage-gated L-type calcium channel Voltage-gated calcium channel subunit alpha Cav1.1
Type:
PROTEIN
Mol. Mass.:
210392.58
Organism:
Rattus norvegicus
Description:
ChEMBL_92777
Residue:
1850
  
Inhibitor
Name:
BDBM85330
Synonyms:
CAS_68647 ONDANSETRON | Ondansetron hydrochloride
Type:
Small organic molecule
Emp. Form.:
C18H19N3O
Mol. Mass.:
293.363
SMILES:
Cc1nccn1CC1CCc2c(C1=O)c1ccccc1n2C
: