Target
Carbonic anhydrase 2
Ligand
BDBM26987
Substrate
Meas. Tech.
ChEMBL_1288553 (CHEMBL3118986)
Ki
73000000±n/a nM
Citation
 Nishimori, IVullo, DMinakuchi, TScozzafava, AOsman, SMAlOthman, ZCapasso, CSupuran, CT Anion inhibition studies of two new ?-carbonic anhydrases from the bacterial pathogen Legionella pneumophila. Bioorg Med Chem Lett 24:1127-32 (2014)  
Target
Name:
Carbonic anhydrase 2
Synonyms:
CA-II CAC Carbonate dehydratase II Carbonic anhydrase 2 (CA-II) Carbonic anhydrase C Carbonic anhydrase II (CA-II) Carbonic anhydrase II (hCA II) | Carbonic anhydrase isoenzyme II (hCA II)
Type:
Enzyme
Mol. Mass.:
29250.71
Organism:
Homo sapiens (Human)
Description:
P00918
Residue:
260
  
Inhibitor
Name:
BDBM26987
Synonyms:
CHEMBL180485 SODIUM CARBONATE carbonate ion
Type:
Ion
Emp. Form.:
CO3
Mol. Mass.:
60.01
SMILES:
[O-]C([O-])=O
: