Target
Neuraminidase
Ligand
BDBM69609
Substrate
Meas. Tech.
ChEMBL_1295475 (CHEMBL3131473)
IC50
14100±n/a nM
Citation
 Grienke, UBraun, HSeidel, NKirchmair, JRichter, MKrumbholz, Avon Grafenstein, SLiedl, KRSchmidtke, MRollinger, JM Computer-guided approach to access the anti-influenza activity of licorice constituents. J Nat Prod 77:563-70 (2014)  
Target
Name:
Neuraminidase
Synonyms:
NA | NRAM_I33A0
Type:
PROTEIN
Mol. Mass.:
49687.56
Organism:
Influenza A virus
Description:
ChEMBL_1347422
Residue:
453
  
Inhibitor
Name:
BDBM69609
Synonyms:
(2S)-7-hydroxy-2-[4-hydroxy-3-(3-methylbut-2-enyl)phenyl]-8-(3-methylbut-2-enyl)-2,3-dihydrochromen-4-one (2S)-7-hydroxy-2-[4-hydroxy-3-(3-methylbut-2-enyl)phenyl]-8-(3-methylbut-2-enyl)chroman-4-one MLS000697605 cid_11596309 | glabrol
Type:
Small organic molecule
Emp. Form.:
C25H28O4
Mol. Mass.:
392.4874
SMILES:
[#6]\[#6](-[#6])=[#6]\[#6]-c1cc(ccc1-[#8])-[#6@@H]-1-[#6]-[#6](=O)-c2ccc(-[#8])c(-[#6]\[#6]=[#6](\[#6])-[#6])c2-[#8]-1
: