Target
Acyl-protein thioesterase 2
Ligand
BDBM50496625
Substrate
Meas. Tech.
ChEMBL_1300904 (CHEMBL3135191)
IC50
200±n/a nM
Citation
 Davda, DMartin, BR Acyl protein thioesterase inhibitors as probes of dynamic S-palmitoylation. Medchemcomm 5:268-276 (2014)  
Target
Name:
Acyl-protein thioesterase 2
Synonyms:
APT2 LYPA2_HUMAN Lysophospholipase II
Type:
Protein
Mol. Mass.:
24740.23
Organism:
Homo sapiens (Human)
Description:
O95372
Residue:
231
  
Inhibitor
Name:
BDBM50496625
Synonyms:
CHEMBL3133033
Type:
Small organic molecule
Emp. Form.:
C21H22N4O2
Mol. Mass.:
362.425
SMILES:
OC(c1cnn(n1)C(=O)N1CCCCC1)(c1ccccc1)c1ccccc1
: