Target
2-amino-4-hydroxy-6-hydroxymethyldihydropteridine pyrophosphokinase
Ligand
BDBM50497028
Substrate
Meas. Tech.
ChEMBL_1335027 (CHEMBL3239458)
Kd
1050±n/a nM
Citation
 Yun, MKHoagland, DKumar, GWaddell, MBRock, COLee, REWhite, SW The identification, analysis and structure-based development of novel inhibitors of 6-hydroxymethyl-7,8-dihydropterin pyrophosphokinase. Bioorg Med Chem 22:2157-65 (2014)  
Target
Name:
2-amino-4-hydroxy-6-hydroxymethyldihydropteridine pyrophosphokinase
Synonyms:
2-amino-4-hydroxy-6-hydroxymethyldihydropteridine pyrophosphokinase 7,8-dihydro-6-hydroxymethylpterin-pyrophosphokinase HPPK_ECOLI PPPK | folK
Type:
PROTEIN
Mol. Mass.:
18075.55
Organism:
Escherichia coli (strain K12)
Description:
ChEMBL_108237
Residue:
159
  
Inhibitor
Name:
BDBM50497028
Synonyms:
CHEMBL3233217
Type:
Small organic molecule
Emp. Form.:
C7H9N5O2
Mol. Mass.:
195.1787
SMILES:
NC1Nc2ncc(CO)nc2C(O)=N1
: