Target
Beta-galactosidase
Ligand
BDBM50261419
Substrate
Meas. Tech.
ChEMBL_1438445 (CHEMBL3384257)
Ki
11±n/a nM
Citation
 Fan, QHClaunch, KAStriegler, S Structure-activity relationship of highly potent galactonoamidine inhibitors toward ?-galactosidase (Aspergillus oryzae). J Med Chem 57:8999-9009 (2014)  
Target
Name:
Beta-galactosidase
Synonyms:
3.2.1.23 | Beta-galactosidase
Type:
PROTEIN
Mol. Mass.:
100763.98
Organism:
Aspergillus oryzae
Description:
ChEMBL_109122
Residue:
909
  
Inhibitor
Name:
BDBM50261419
Synonyms:
CHEMBL3359674
Type:
Small organic molecule
Emp. Form.:
C13H26N2O4
Mol. Mass.:
274.3565
SMILES:
CCCCCCC\N=C1/N[C@H](CO)[C@H](O)[C@H](O)[C@H]1O
: