Target
Cytochrome P450 2D6
Ligand
BDBM50121975
Substrate
Meas. Tech.
ChEMBL_1440788 (CHEMBL3373322)
IC50
120±n/a nM
Citation
 Ayan, DMaltais, RHospital, APoirier, D Chemical synthesis, cytotoxicity, selectivity and bioavailability of 5?-androstane-3?,17?-diol derivatives. Bioorg Med Chem 22:5847-59 (2014)  
Target
Name:
Cytochrome P450 2D6
Synonyms:
CP2D6_HUMAN CYP2DL1 Cytochrome P450 2D6 (CYP2D6) P450-DB1
Type:
Protein
Mol. Mass.:
55774.82
Organism:
Homo sapiens (Human)
Description:
P10635
Residue:
497
  
Inhibitor
Name:
BDBM50121975
Synonyms:
(6-Methoxy-quinolin-4-yl)-(5-vinyl-1-aza-bicyclo[2.2.2]oct-2-yl)-methanol CHEMBL1294 DURAQUIN QUINAGLUTE QUINATIME QUINIDINE US9402878, Quinidine
Type:
Small organic molecule
Emp. Form.:
C20H24N2O2
Mol. Mass.:
324.4168
SMILES:
COc1ccc2nccc([C@H](O)[C@H]3C[C@@H]4CCN3C[C@@H]4C=C)c2c1
: