Target
Voltage-dependent L-type calcium channel subunit alpha-1C/alpha-1D/alpha-1F/alpha-1S
Ligand
BDBM25351
Substrate
Meas. Tech.
ChEMBL_1479221 (CHEMBL3436197)
IC50
246700±n/a nM
Citation
 Kramer, JObejero-Paz, CAMyatt, GKuryshev, YABruening-Wright, AVerducci, JSBrown, AM MICE models: superior to the HERG model in predicting Torsade de Pointes. Sci Rep 3:0 (2013)  
Target
Name:
Voltage-dependent L-type calcium channel subunit alpha-1C/alpha-1D/alpha-1F/alpha-1S
Synonyms:
Voltage-gated L-type calcium channel
Type:
Mol. Mass.:
Description:
ASSAY_ID of ChEMBL is 92767
Components:
This complex has 4 components.
Component 1
Name:
Voltage-dependent L-type calcium channel subunit alpha-1D
Synonyms:
CAC1D_HUMAN CACN4 CACNL1A2 Calcium channel, L type, alpha-1 polypeptide, isoform 2 Voltage-gated L-type calcium channel Voltage-gated calcium channel | Voltage-gated calcium channel subunit alpha Cav1.3
Type:
PROTEIN
Mol. Mass.:
245144.84
Organism:
Homo sapiens (Human)
Description:
ChEMBL_1350501
Residue:
2161
  
Component 2
Name:
Voltage-dependent L-type calcium channel subunit alpha-1C
Synonyms:
CAC1C_HUMAN CACN2 CACNL1A1 Calcium channel (Type L) L-type calcium channel alpha-1c/beta-2/alpha2delta-1 Voltage-gated L-type calcium channel Voltage-gated calcium channel | Voltage-gated calcium channel subunit alpha Cav1.2
Type:
Enzyme Catalytic Domain
Mol. Mass.:
248979.79
Organism:
Homo sapiens (Human)
Description:
Calcium channel (Type L) 0 HUMAN::Q13936
Residue:
2221
  
Component 3
Name:
Voltage-dependent L-type calcium channel subunit alpha-1S
Synonyms:
CAC1S_HUMAN CACN1 CACNL1A3 Voltage-dependent L-type calcium channel subunit alpha-1S Voltage-gated L-type calcium channel alpha-1S subunit Voltage-gated calcium channel subunit alpha Cav1.1
Type:
PROTEIN
Mol. Mass.:
212348.33
Organism:
Homo sapiens (Human)
Description:
ChEMBL_42767
Residue:
1873
  
Component 4
Name:
Voltage-dependent L-type calcium channel subunit alpha-1F
Synonyms:
CAC1F_HUMAN CACNAF1 Voltage-gated calcium channel | Voltage-gated calcium channel subunit alpha Cav1.4
Type:
PROTEIN
Mol. Mass.:
220661.87
Organism:
Homo sapiens (Human)
Description:
ChEMBL_105734
Residue:
1977
  
Inhibitor
Name:
BDBM25351
Synonyms:
N-[2-(4-{[(4-fluorophenyl)methyl]carbamoyl}-5-hydroxy-1-methyl-6-oxo-1,6-dihydropyrimidin-2-yl)propan-2-yl]-5-methyl-1,3,4-oxadiazole-2-carboxamide | Raltegravir
Type:
Small organic molecule
Emp. Form.:
C20H21FN6O5
Mol. Mass.:
444.4163
SMILES:
Cc1nnc(o1)C(=O)NC(C)(C)c1nc(C(=O)NCc2ccc(F)cc2)c(O)c(=O)n1C
: