Target
Urease subunit beta
Ligand
BDBM50099857
Substrate
Meas. Tech.
ChEMBL_1508397 (CHEMBL3602335)
IC50
27600±n/a nM
Citation
 Wang, XDWei, WWang, PFYi, LCShi, WKXie, YXWu, LZTang, NZhu, LSPeng, JLiu, CLi, XHTang, SXiao, ZPZhu, HL Synthesis, molecular docking and biological evaluation of 3-arylfuran-2(5H)-ones as anti-gastric ulcer agent. Bioorg Med Chem 23:4860-4865 (2015)  
Target
Name:
Urease subunit beta
Synonyms:
3.5.1.5 Urea amidohydrolase subunit beta hpuB | ureB
Type:
PROTEIN
Mol. Mass.:
61676.43
Organism:
Helicobacter pylori (strain ATCC 700392 / 26695) (Campylobacterpylori)
Description:
ChEMBL_117195
Residue:
569
  
Inhibitor
Name:
BDBM50099857
Synonyms:
ACETOHYDROXAMIC ACID (AHA) Acethydroxamsaeure Acetic acid, oxime Cetohyroxamic acid Methylhydroxamic acid N-Acetylhydroxylamine acetohydroxamic acid
Type:
Small organic molecule
Emp. Form.:
C2H5NO2
Mol. Mass.:
75.0666
SMILES:
CC(=O)NO
: