Target
Lysine-specific demethylase 4E
Ligand
BDBM50498673
Substrate
Meas. Tech.
ChEMBL_1519859 (CHEMBL3624702)
IC50
398±n/a nM
Citation
 England, KSTumber, AKrojer, TScozzafava, GNg, SSDaniel, MSzykowska, AChe, Kvon Delft, FBurgess-Brown, NAKawamura, ASchofield, CJBrennan, PE Optimisation of a triazolopyridine based histone demethylase inhibitor yields a potent and selective KDM2A (FBXL11) inhibitor. Medchemcomm 5:1879-1886 (2014)  
Target
Name:
Lysine-specific demethylase 4E
Synonyms:
2-OG-Dependent Histone Demethylase JMJD2E Jumonji domain-containing protein 2E (JMJD2E) KDM4DL KDM4E_HUMAN Lysine-specific demethylase 4E | Lysine-specific demethylase 4E (KDM4E)
Type:
Enzyme
Mol. Mass.:
56815.71
Organism:
Homo sapiens (Human)
Description:
B2RXH2
Residue:
506
  
Inhibitor
Name:
BDBM50498673
Synonyms:
CHEMBL3621852
Type:
Small organic molecule
Emp. Form.:
C11H8N2O2
Mol. Mass.:
200.1934
SMILES:
OC(=O)c1ccnc(c1)-c1ccccn1
: