Target
Prostaglandin G/H synthase 1
Ligand
BDBM50022271
Substrate
Meas. Tech.
ChEMBL_1542270 (CHEMBL3745492)
IC50
67±n/a nM
Citation
 Zhang, YTortorella, MDLiao, JQin, XChen, TLuo, JGuan, JTalley, JJTu, Z Synthesis and Evaluation of Novel Erlotinib-NSAID Conjugates as More Comprehensive Anticancer Agents. ACS Med Chem Lett 6:1086-90 (2015)  
Target
Name:
Prostaglandin G/H synthase 1
Synonyms:
COX1 Cyclooxygenase-1 (COX-1) PTGS1 | Prostaglandin G/H synthase (cyclooxygenase)
Type:
Protein
Mol. Mass.:
68868.60
Organism:
Ovis aries (Sheep)
Description:
Residue:
600
  
Inhibitor
Name:
BDBM50022271
Synonyms:
2-(3-Benzoylphenyl)propionic acid 3-Benzoyl-alpha-methylbenzeneacetic acid CHEMBL571 KETOPROFEN Orudis (TN) | m-Benzoylhydratropic acid
Type:
Small organic molecule
Emp. Form.:
C16H14O3
Mol. Mass.:
254.2806
SMILES:
CC(C(O)=O)c1cccc(c1)C(=O)c1ccccc1
: