Target
Dihydrofolate reductase
Ligand
BDBM50049905
Substrate
Meas. Tech.
ChEMBL_54280 (CHEMBL669873)
Ki
0.3±n/a nM
Citation
 Kuyper, LFBaccanari, DPJones, MLHunter, RNTansik, RLJoyner, SSBoytos, CMRudolph, SKKnick, VWilson, HRCaddell, JMFriedman, HSComley, JCStables, JN High-affinity inhibitors of dihydrofolate reductase: antimicrobial and anticancer activities of 7,8-dialkyl-1,3-diaminopyrrolo[3,2-f]quinazolines with small molecular size. J Med Chem 39:892-903 (1996)  
Target
Name:
Dihydrofolate reductase
Synonyms:
DHFR Dihydrofolate reductase (DHFR) | Tetrahydrofolate dehydrogenase
Type:
Enzyme
Mol. Mass.:
21453.99
Organism:
Homo sapiens (Human)
Description:
Recombinant human DHFR.
Residue:
187
  
Inhibitor
Name:
BDBM50049905
Synonyms:
7-(1-Ethyl-propyl)-8-methyl-7H-pyrrolo[3,2-f]quinazoline-1,3-diamine TCMDC-137283
Type:
Small organic molecule
Emp. Form.:
C16H21N5
Mol. Mass.:
283.3714
SMILES:
CCC(CC)n1c(C)cc2c1ccc1nc(N)nc(N)c21
: